Ontology for Templates (partly)
type: Ontology
comment: Ontology for Templates (partly), according ISO 15926-7 and in OWL Full
imports: part2
imports: part4
version info: February 2006

addressee
type: ObjectProperty
comment: the physical object to which something is sent

basePropertyType
type: ObjectProperty
comment: a class_of_property on which the indirect_property is based

beginning
type: ObjectProperty
comment: date and time that the possible_individual instance begins its existence

compositionType
type: ObjectProperty
comment: defines the kind of composition relationship

containedDocument
type: ObjectProperty
comment: refers to a document that belongs to the payload of a Message

defined
type: ObjectProperty
comment: the class to which the definition applies

definition
type: ObjectProperty
comment: a definition in text, code, picture, or otherwise

definitionType
type: ObjectProperty
comment: the type of definition given (text, code, picture, or otherwise)

describes
type: ObjectProperty
comment: a description of the subject by the object

document
type: ObjectProperty
comment: refers to a document

ending
type: ObjectProperty
comment: the date and time that the possible_individual instance ends its existence

hasAsContext
type: ObjectProperty
comment: refers to templates that give contextual information about the objects in a document

hasAsInfo
type: ObjectProperty
comment: refers to a template in which the information of a document cells is represented

hasPresentationScript
type: ObjectProperty
comment: refers to a string that is a script (XSLT or other) for presentation of the document

hasPrompt
type: ObjectProperty
comment: refers to a string that is the prompt of a document part or cell

hasScript
type: ObjectProperty
comment: refers to a string that is a script, either for mapping or for fetching data (SPARQL or other) from the hasAsInfo template for inserting in the document cell

identified
type: ObjectProperty
comment: the thing that is identified

identifier
type: ObjectProperty
comment: text, picture, biometrics, or otherwise that identifies the identified thing

identifierType
type: ObjectProperty
comment: the type of identifier (text, picture, biometrics, or otherwise)

includedThing
type: ObjectProperty
comment: the nodes and templates that are part of a transfer file

individual
type: ObjectProperty
comment: the instance of POSSIBLE_INDIVIDUAL involved

isAbout
type: ObjectProperty
comment: refers to the thing(s) about which information is contained in the applicable document

isDocCellOf
type: ObjectProperty
comment: refers to the document or document part that it is a document cell of

isDocPartOf
type: ObjectProperty
comment: refers to the document or document part that it is a document part of

isValidAt
type: ObjectProperty
comment: the date-time at which the information in a document is valid

numericalValue
type: ObjectProperty
comment: the applicable number value

part
type: ObjectProperty
comment: plays the role of a part of a whole in a composition relationship

physicalFile
type: ObjectProperty
comment: refers to the system ID of the file of a message

possessor
type: ObjectProperty
comment: the possessing individual

propertyType
type: ObjectProperty
comment: the kind of property

sender
type: ObjectProperty
comment: refers to a physical object that is the sender of the applicable message

sentPhysicalFile
type: ObjectProperty
comment: the temporal part of the individual that is the RDF/XML file that is being transmitted

temporalPart
type: ObjectProperty
comment: the individual that is the temporal part of another individual

temporalWhole
type: ObjectProperty
comment: the individual that is the temporal whole of another individual

transmission
type: ObjectProperty
comment: refers to the transmitting activity of the applicable RDF/XML file

transmissionDateTime
type: ObjectProperty
comment: refers to date-time that the start of the transmitting activity of the applicable RDF/XML file took place

transmittal
type: ObjectProperty
comment: refers to a template, giving basic information about the transmission of an RDF/XML file.

unitOfMeasure
type: ObjectProperty
comment: the scale to which the property is quantified

whole
type: ObjectProperty
comment: plays the role of the whole of related to a part in a composition relationship

wholeLifePhysicalFile
type: ObjectProperty
comment: the whole-life part of the individual that is the RDF/XML file that is being transmitted

information about a document cell
type: ClassOfMultidimensionalObject
subclass of: RDL-ST
subclass of: Restriction
  on property: isDocCellOf
  all values from: RDL-1138994 AND RDL-1138995
  cardinality: 1
subclass of: Restriction
  on property: describes
  all values from: RDL-1138996
  cardinality: 1
subclass of: Restriction
  on property: hasPrompt
  all values from: RDL-9223201
subclass of: Restriction
  on property: hasAsInfo
  all values from: RDL-ST
subclass of: Restriction
  on property: hasScript
  all values from: RDL-9223201

information about a document part
type: ClassOfMultidimensionalObject
subclass of: RDL-ST
subclass of: Restriction
  on property: isDocPartOf
  all values from: RDL-1138994 AND RDL-1138995
  cardinality: 1
subclass of: Restriction
  on property: describes
  all values from: RDL-1138995
  cardinality: 1
subclass of: Restriction
  on property: hasPrompt
  all values from: RDL-9223201
subclass of: Restriction
  on property: isAbout
  all values from: Thing
subclass of: Restriction
  on property: hasAsContext
  all values from: RDL-ST

information about a document
type: ClassOfMultidimensionalObject
subclass of: RDL-ST
subclass of: Restriction
  on property: describes
  all values from: RDL-1138994
  cardinality: 1
subclass of: Restriction
  on property: isAbout
  all values from: Thing
subclass of: Restriction
  on property: isValidAt
  all values from: RDL-9223207
  cardinality: 1
subclass of: Restriction
  on property: hasPrompt
  all values from: RDL-9223201
subclass of: Restriction
  on property: hasAsContext
  all values from: RDL-ST
subclass of: Restriction
  on property: hasPresentationScript
  all values from: RDL-9223201

transmittal
type: ClassOfMultidimensionalObject
subclass of: RDL-ST
subclass of: Restriction
  on property: transmission
  all values from: Activity
  cardinality: 1
subclass of: Restriction
  on property: transmissionDateTime
  all values from: RDL-9223207
  cardinality: 1
subclass of: Restriction
  on property: wholeLifePhysicalFile
  all values from: MaterializedPhysicalObject
  cardinality: 1
subclass of: Restriction
  on property: sentPhysicalFile
  all values from: MaterializedPhysicalObject
  cardinality: 1
subclass of: Restriction
  on property: sender
  all values from: MaterializedPhysicalObject
  cardinality: 1
subclass of: Restriction
  on property: addressee
  all values from: MaterializedPhysicalObject
  cardinality: 1

information about an ISO 15926-7 message
type: ClassOfMultidimensionalObject
subclass of: RDL-ST
subclass of: Restriction
  on property: describes
  all values from: RDL-5407010
  cardinality: 1
subclass of: Restriction
  on property: transmittal
  all values from: transmittal
  cardinality: 1
subclass of: Restriction
  on property: containedDocument
  all values from: RDL-1138994
  min cardinality: 1

information about an ISO 15926-7 data transfer file
type: ClassOfMultidimensionalObject
subclass of: RDL-ST
subclass of: Restriction
  on property: describes
  all values from: RDL-5407005
  cardinality: 1
subclass of: Restriction
  on property: transmittal
  all values from: transmittal
  cardinality: 1
subclass of: Restriction
  on property: includedThing
  all values from: Thing
  min cardinality: 1

composition relationship between two physical objects
type: ClassOfMultidimensionalObject
label: has a [from:{queryid}|?t1 part7:identified <{queryid}> . ?t1 part7:identifierType ?id .|from:{id}|{id_to_short_name}] of [from:{queryid}|?t1 part7:identified <{queryid}> . ?t1 part7:identifier ?x1 .|from:{x1}|<{x1}> part2:content ?literal]
subclass of: RDL-ST
subclass of: Restriction
  on property: identified
  all values from: PossibleIndividual
  cardinality: 1
subclass of: Restriction
  on property: identifier
  all values from: RDL-9223200
  cardinality: 1
subclass of: Restriction
  on property: identifierType
  all values from: ClassOfClassOfIdentification
  cardinality: 1
subclass of: Restriction
  on property: part
  all values from: PhysicalObject
  cardinality: 1
subclass of: Restriction
  on property: whole
  all values from: PhysicalObject
  cardinality: 1
subclass of: Restriction
  on property: compositionType
  all values from: ClassOfCompositionOfIndividual
  cardinality: 1

beginning of the existence of a whole-life individual
type: ClassOfMultidimensionalObject
subclass of: RDL-ST
subclass of: Restriction
  on property: individual
  all values from: PossibleIndividual
  cardinality: 1
subclass of: Restriction
  on property: beginning
  all values from: RDL-9223207
  cardinality: 1

beginning of the existence of a temporal part of an individual
type: ClassOfMultidimensionalObject
subclass of: RDL-ST
subclass of: Restriction
  on property: temporalWhole
  all values from: PossibleIndividual
  cardinality: 1
subclass of: Restriction
  on property: temporalPart
  all values from: PossibleIndividual
  cardinality: 1
subclass of: Restriction
  on property: beginning
  all values from: RDL-9223207
  cardinality: 1

ending of the existence of an individual
type: ClassOfMultidimensionalObject
subclass of: RDL-ST
subclass of: Restriction
  on property: individual
  all values from: PossibleIndividual
  cardinality: 1
subclass of: Restriction
  on property: ending
  all values from: RDL-9223207
  cardinality: 1

ST-3401
type: ClassOfMultidimensionalObject
label: has a [from:{queryid}|?t1 part7:identified <{queryid}> . ?t1 part7:identifierType ?id .|from:{id}|{id_to_short_name}] of [from:{queryid}|?t1 part7:identified <{queryid}> . ?t1 part7:identifier ?x1 .|from:{x1}|<{x1}> part2:content ?literal]
subclass of: RDL-ST
subclass of: Restriction
  on property: possessor
  all values from: PossibleIndividual
  cardinality: 1
subclass of: Restriction
  on property: propertyType
  all values from: ClassOfIndirectProperty
  cardinality: 1
subclass of: Restriction
  on property: basePropertyType
  all values from: SinglePropertyDimension
  cardinality: 1
subclass of: Restriction
  on property: numericalValue
  all values from: RDL-9223204
  cardinality: 1
subclass of: Restriction
  on property: unitOfMeasure
  all values from: Scale
  cardinality: 1